Clang Error In Xcode 10

opencv xcode 9 Undefined symbols for architecture arm64

opencv xcode 9 Undefined symbols for architecture arm64

Read more
scan-build: running the analyzer from the command line

scan-build: running the analyzer from the command line

Read more
更新Xcode10后,报/clang:-1: linker command failed wi    - 简书

更新Xcode10后,报/clang:-1: linker command failed wi - 简书

Read more
Xcode Coverage | Cocoanetics

Xcode Coverage | Cocoanetics

Read more
Parsing C++ Files with the Clang Code Model | Qt Creator Manual

Parsing C++ Files with the Clang Code Model | Qt Creator Manual

Read more
How to Uninstall XCode

How to Uninstall XCode

Read more
Xcode - portablecontacts net

Xcode - portablecontacts net

Read more
FutureBASIC 6 0 2 Free Download for Mac | MacUpdate

FutureBASIC 6 0 2 Free Download for Mac | MacUpdate

Read more
Mastering App Development with Xcode Targets

Mastering App Development with Xcode Targets

Read more
基于LLVM开发Clang插件进行代码风格检查- CocoaChina_一站式开发

基于LLVM开发Clang插件进行代码风格检查- CocoaChina_一站式开发

Read more
XCode Tip: Catch More Bugs With The Clang Analyzer

XCode Tip: Catch More Bugs With The Clang Analyzer

Read more
Mac OS 10 15 Catalina issues - Homebrew

Mac OS 10 15 Catalina issues - Homebrew

Read more
Clang + OpenMP Setup in Xcode – Anton Menshov

Clang + OpenMP Setup in Xcode – Anton Menshov

Read more
iOS and Android setup on MacOS - Build Failed when trying to

iOS and Android setup on MacOS - Build Failed when trying to

Read more
Ld Framework Not Found Xcode | Framebob org

Ld Framework Not Found Xcode | Framebob org

Read more
Error when building SampleScene from ARFoundation to iPhone

Error when building SampleScene from ARFoundation to iPhone

Read more
clang: error: linker command failed with … - Apple Community

clang: error: linker command failed with … - Apple Community

Read more
duplicate symbol _OBJC_CLASS_$_PodsDummy_Pods_packager

duplicate symbol _OBJC_CLASS_$_PodsDummy_Pods_packager

Read more
Getting

Getting "linker command failed with exit code 1 (use -v to

Read more
Using a native 3rd party in Kony

Using a native 3rd party in Kony

Read more
Getting error

Getting error "linker command failed with exit code 1 (use

Read more
Integrating Unity and Vuforia with a iOS Swift Project

Integrating Unity and Vuforia with a iOS Swift Project

Read more
App Center Build Frequently Asked Questions - Visual Studio

App Center Build Frequently Asked Questions - Visual Studio

Read more
FAQ · Kiwisec

FAQ · Kiwisec

Read more
How to Fix Apple Mach-O Linker Error- Xcode? +1-800-763-4027

How to Fix Apple Mach-O Linker Error- Xcode? +1-800-763-4027

Read more
18 10 community edition on Mac OS 10 13 6 - User Forums

18 10 community edition on Mac OS 10 13 6 - User Forums

Read more
Installing Xcode and Compiling Objective-C on Mac OS X

Installing Xcode and Compiling Objective-C on Mac OS X

Read more
Upgrade from Kony Visualizer 7 3 0 to Kony Visalizer 8 3 2

Upgrade from Kony Visualizer 7 3 0 to Kony Visalizer 8 3 2

Read more
Xcode - symbol(s) not found for architecture x86_64

Xcode - symbol(s) not found for architecture x86_64

Read more
Xcode - portablecontacts net

Xcode - portablecontacts net

Read more
Renaming Xcode Project | Treehouse Community

Renaming Xcode Project | Treehouse Community

Read more
XCode 10 0 build errors - x-code - openFrameworks

XCode 10 0 build errors - x-code - openFrameworks

Read more
Appendix: Answers to Exercises - Learn C on the Mac: For OS

Appendix: Answers to Exercises - Learn C on the Mac: For OS

Read more
Install from scratch new empty project won't compile | Qt Forum

Install from scratch new empty project won't compile | Qt Forum

Read more
Unity Xcode Clang Error

Unity Xcode Clang Error

Read more
clang: error: unknown argument: '-fobjc-gc' - HDK : Houdini

clang: error: unknown argument: '-fobjc-gc' - HDK : Houdini

Read more
Error when building SampleScene from ARFoundation to iPhone

Error when building SampleScene from ARFoundation to iPhone

Read more
Help installing in macos mojave 10 14 2 - MRtrix3 Community

Help installing in macos mojave 10 14 2 - MRtrix3 Community

Read more
Clean Up Xcode

Clean Up Xcode

Read more
Best IDE Software - a List of the Top 10 - KeyCDN

Best IDE Software - a List of the Top 10 - KeyCDN

Read more
ios 앱 컴파일시 에러 apple mach-o linker error : 네이버 블로그

ios 앱 컴파일시 에러 apple mach-o linker error : 네이버 블로그

Read more
TensorFlow with GPU on your Mac — Installing CUDA, cuDNN and

TensorFlow with GPU on your Mac — Installing CUDA, cuDNN and

Read more
Solved: I Am Working On A Program On Xcode, However, I Hav

Solved: I Am Working On A Program On Xcode, However, I Hav

Read more
Ld Symbol S Not Found For Architecture Arm64 Clang Error

Ld Symbol S Not Found For Architecture Arm64 Clang Error

Read more
atom-clang

atom-clang

Read more
消除Xcode iOS项目的警告 - 简书

消除Xcode iOS项目的警告 - 简书

Read more
Advanced Debugging with Xcode and LLDB - WWDC 2018 - Videos

Advanced Debugging with Xcode and LLDB - WWDC 2018 - Videos

Read more
0 11 — Configuring your compiler: Warning and error levels

0 11 — Configuring your compiler: Warning and error levels

Read more
How to link to Intel® IPP for macOS* Libraries in an

How to link to Intel® IPP for macOS* Libraries in an

Read more
Xcode(Swift) + CocoaPodsでgRPCのClientを生成してServiceを

Xcode(Swift) + CocoaPodsでgRPCのClientを生成してServiceを

Read more
Building on Mac 10 14 Mojave - Development - 3D Slicer Community

Building on Mac 10 14 Mojave - Development - 3D Slicer Community

Read more
XCode各种问题- 洛易- 博客园

XCode各种问题- 洛易- 博客园

Read more
Xcode Build Settings in Depth - Heartbeat

Xcode Build Settings in Depth - Heartbeat

Read more
Clover Builder app - Bootloaders - InsanelyMac Forum

Clover Builder app - Bootloaders - InsanelyMac Forum

Read more
Lets learn mobile automation testing - calabash: Calabash

Lets learn mobile automation testing - calabash: Calabash

Read more
What's inside the Derived Data folder? · VojtaStavik com

What's inside the Derived Data folder? · VojtaStavik com

Read more
HOWTO: Setup XCode 6 1 to work with OpenCV3 libraries

HOWTO: Setup XCode 6 1 to work with OpenCV3 libraries

Read more
Clang C/C++ Download and Installation Instructions

Clang C/C++ Download and Installation Instructions

Read more
Xcode: clang: error: linker command failed with exit code 1

Xcode: clang: error: linker command failed with exit code 1

Read more
Build error with iOS 11 4, SDK 0 8 - Structure SDK (for iOS

Build error with iOS 11 4, SDK 0 8 - Structure SDK (for iOS

Read more
Help with brms error - General - Stan

Help with brms error - General - Stan

Read more
Build HelloWorld error - Beginner Questions - ITK

Build HelloWorld error - Beginner Questions - ITK

Read more
Xcode Archive Undefined Symbols For Architecture Armv7

Xcode Archive Undefined Symbols For Architecture Armv7

Read more
macOS: Install OpenCV 3 and Python 3 5 - PyImageSearch

macOS: Install OpenCV 3 and Python 3 5 - PyImageSearch

Read more
iOS Build Failure - ld: symbol(s) not found for architecture

iOS Build Failure - ld: symbol(s) not found for architecture

Read more
Xcode 10: third-party: 'config h' file not found · Issue

Xcode 10: third-party: 'config h' file not found · Issue

Read more
Xcode Build Settings in Depth - Heartbeat

Xcode Build Settings in Depth - Heartbeat

Read more
Clean Up Xcode

Clean Up Xcode

Read more
ARKit and Unity - blog

ARKit and Unity - blog

Read more
iOS package Undefined symbols for architecture armv7 - UE4

iOS package Undefined symbols for architecture armv7 - UE4

Read more
Xcode] Apple Mach-O Linker (ld) Error Group   clang: error

Xcode] Apple Mach-O Linker (ld) Error Group clang: error

Read more
CodeSonar Enters the World of iOS and Objective-C

CodeSonar Enters the World of iOS and Objective-C

Read more
Xcode Clang Error

Xcode Clang Error

Read more
Trouble building the app · Issue #44 · SudoPlz/react-native

Trouble building the app · Issue #44 · SudoPlz/react-native

Read more
Unity - Manual: Troubleshooting on iOS devices

Unity - Manual: Troubleshooting on iOS devices

Read more
Xcode Warnings: Turn Them Up to Eleven! • Quality Coding

Xcode Warnings: Turn Them Up to Eleven! • Quality Coding

Read more
Xcode Warnings: Turn Them Up to Eleven! • Quality Coding

Xcode Warnings: Turn Them Up to Eleven! • Quality Coding

Read more
FAQ · Kiwisec

FAQ · Kiwisec

Read more
eXtend Security on Xcode

eXtend Security on Xcode

Read more
Note able to find Xcode 10 - Developer Community

Note able to find Xcode 10 - Developer Community

Read more
Faux Pas for Xcode

Faux Pas for Xcode

Read more
Solve the problem of upgrading to Xcode10, react native

Solve the problem of upgrading to Xcode10, react native

Read more
Static analyzers for Swift and Objective-C - HackerBay

Static analyzers for Swift and Objective-C - HackerBay

Read more
Switching Swift Versions inside Xcode using Toolchains

Switching Swift Versions inside Xcode using Toolchains

Read more
qt | Successful Software

qt | Successful Software

Read more
Resolution for Vuforia 7 / iOS 11 3 black screen problem

Resolution for Vuforia 7 / iOS 11 3 black screen problem

Read more
Xcode error ld: framework not found AudioUnit clang: error

Xcode error ld: framework not found AudioUnit clang: error

Read more
Planet Clang

Planet Clang

Read more
Improving Your Build Time in Xcode 10 · Patrick Balestra

Improving Your Build Time in Xcode 10 · Patrick Balestra

Read more
iOS common crash information and knowledge points

iOS common crash information and knowledge points

Read more
Setting Up An SDL2 Project In Xcode 9 | Matthew Styles

Setting Up An SDL2 Project In Xcode 9 | Matthew Styles

Read more
Xcode 10 2, macOS Mojave 10 14 4, iOS 12 1 and other betas

Xcode 10 2, macOS Mojave 10 14 4, iOS 12 1 and other betas

Read more
How to install gcc compiler on Mac OS X – Mkyong com

How to install gcc compiler on Mac OS X – Mkyong com

Read more
Creating and Distributing an iOS Binary Framework | Instabug

Creating and Distributing an iOS Binary Framework | Instabug

Read more
Faux Pas for Xcode

Faux Pas for Xcode

Read more
SQLCipher Community Edition - iOS and macOS Tutorial - Zetetic

SQLCipher Community Edition - iOS and macOS Tutorial - Zetetic

Read more
FAQ and How to Deal with Common False Positives

FAQ and How to Deal with Common False Positives

Read more
Xcode organizer permission denied download

Xcode organizer permission denied download

Read more
Apple LLVM Compiler Error 4 1 - Stack Overflow

Apple LLVM Compiler Error 4 1 - Stack Overflow

Read more
How do I manually add Pods/Headers/Public to the Header

How do I manually add Pods/Headers/Public to the Header

Read more